Post Reply 
 
Thread Rating:
  • 0 Votes - 0 Average
  • 1
  • 2
  • 3
  • 4
  • 5
[bug]lockstep not works when install think
05-24-2018, 05:26 PM (This post was last modified: 05-25-2018 11:39 AM by qiracle.)
Post: #1
[bug]lockstep not works when install think
In gm112 installation , node-1 ,2, 3, 4 is exist and node-5,6 is not exist temporarily。When i install software in gm112-2, an error has occurred, The log as follow:

Code:
[1527151369.972737s] Error connect to VPC 0x6050200 .^M
[1527151369.972740s] 0x6050200: Will retry connecting to container after a while...^M
[1527151372.468750s] ERROR connecting to 10.6.6.2 : 3048 ...^M
[1527151372.468756s] Error connect to VPC 0x6060200 .^M
[1527151372.468759s] 0x6060200: Will retry connecting to container after a while...^M
[1527151373.044718s] ERROR connecting to 10.6.5.2 : 3048 ...^M
[1527151373.044725s] Error connect to VPC 0x6050200 .^M
[1527151373.044727s] 0x6050200: Will retry connecting to container after a while...^M
[1527151373.468863s] 0x6060200: connecting to container failed too many times...^M
[1527151373.468898s] ERROR: connecting to container failed too many times^M
----------------------^M
FAIL^M
Time used: 3:23.31^M
make: *** [test] Error 1^M
Connection to 10.6.2.2 closed.^M
make[1]: *** [test] Error 2
make[1]: Leaving directory `/tmp/root_install1_workdir/think/think-ship'
/thinker/local/shed/installation/think.tar.gz failed with exit status 2
  to install /thinker/local/shed/installation/think.tar.gz
installx think returned 2
ERROR install_quietly is unable to install think [Thu May 24 16:42:56 CST 2018]
Find all posts by this user
Quote this message in a reply
05-24-2018, 05:41 PM
Post: #2
RE: [bug]lockstep not works when installation
(05-24-2018 05:26 PM)qiracle Wrote:  In gm112 installation , node-1 ,2, 3, 4 is exist and node-5,6 is not exist temporarily。When i install software in gm112-2, an error has occurred, The log as follow:

Code:
[1527151369.972737s] Error connect to VPC 0x6050200 .^M
[1527151369.972740s] 0x6050200: Will retry connecting to container after a while...^M
[1527151372.468750s] ERROR connecting to 10.6.6.2 : 3048 ...^M
[1527151372.468756s] Error connect to VPC 0x6060200 .^M
[1527151372.468759s] 0x6060200: Will retry connecting to container after a while...^M
[1527151373.044718s] ERROR connecting to 10.6.5.2 : 3048 ...^M
[1527151373.044725s] Error connect to VPC 0x6050200 .^M
[1527151373.044727s] 0x6050200: Will retry connecting to container after a while...^M
[1527151373.468863s] 0x6060200: connecting to container failed too many times...^M
[1527151373.468898s] ERROR: connecting to container failed too many times^M
----------------------^M
FAIL^M
Time used: 3:23.31^M
make: *** [test] Error 1^M
Connection to 10.6.2.2 closed.^M
make[1]: *** [test] Error 2
make[1]: Leaving directory `/tmp/root_install1_workdir/think/think-ship'
/thinker/local/shed/installation/think.tar.gz failed with exit status 2
  to install /thinker/local/shed/installation/think.tar.gz
installx think returned 2
ERROR install_quietly is unable to install think [Thu May 24 16:42:56 CST 2018]

Its the problem of the module think. Please move it to a proper forum.
Find all posts by this user
Quote this message in a reply
05-24-2018, 06:00 PM
Post: #3
RE: [bug]lockstep not works when installation
(05-24-2018 05:41 PM)rayluk Wrote:  
(05-24-2018 05:26 PM)qiracle Wrote:  In gm112 installation , node-1 ,2, 3, 4 is exist and node-5,6 is not exist temporarily。When i install software in gm112-2, an error has occurred, The log as follow:

Code:
[1527151369.972737s] Error connect to VPC 0x6050200 .^M
[1527151369.972740s] 0x6050200: Will retry connecting to container after a while...^M
[1527151372.468750s] ERROR connecting to 10.6.6.2 : 3048 ...^M
[1527151372.468756s] Error connect to VPC 0x6060200 .^M
[1527151372.468759s] 0x6060200: Will retry connecting to container after a while...^M
[1527151373.044718s] ERROR connecting to 10.6.5.2 : 3048 ...^M
[1527151373.044725s] Error connect to VPC 0x6050200 .^M
[1527151373.044727s] 0x6050200: Will retry connecting to container after a while...^M
[1527151373.468863s] 0x6060200: connecting to container failed too many times...^M
[1527151373.468898s] ERROR: connecting to container failed too many times^M
----------------------^M
FAIL^M
Time used: 3:23.31^M
make: *** [test] Error 1^M
Connection to 10.6.2.2 closed.^M
make[1]: *** [test] Error 2
make[1]: Leaving directory `/tmp/root_install1_workdir/think/think-ship'
/thinker/local/shed/installation/think.tar.gz failed with exit status 2
  to install /thinker/local/shed/installation/think.tar.gz
installx think returned 2
ERROR install_quietly is unable to install think [Thu May 24 16:42:56 CST 2018]

Its the problem of the module think. Please move it to a proper forum.
Moved
Find all posts by this user
Quote this message in a reply
Post Reply 


Forum Jump: